Your achievements

Level 1

0% to

Level 2

Tip /
Sign in

Sign in to Community

to gain points, level up, and earn exciting badges like the new
Bedrock Mission!

Learn more

View all

Sign in to view all badges

neelanshb11
neelanshb11
Online

Badges

Badges
6

Accepted Solutions

Accepted Solutions
0

Likes

Likes
4

Posts

Posts
6

Discussions

Discussions
0

Questions

Questions
6

Ideas

Ideas
0

Blog Posts

Blog Posts
0
Top badges earned by neelanshb11
Customize the badges you want to showcase on your profile
cookie consent implementation
Avatar
Boost 3
Level 2
neelanshb11
Level 2

Likes

4 likes

Total Posts

6 posts

Correct reply

0 solutions
Top badges earned
Boost 3
Ignite 3
Give Back
Validate 1
Boost 1
View profile
neelanshb11
- Adobe Experience Cloud
Hi Community, is there any way to implement cookie consent with popup in aem site ? Please help to suggest.

Views

57

Like

1

Replies

1
Re: AEM as a cloud service : Production Build failing
Avatar
Boost 3
Level 2
neelanshb11
Level 2

Likes

4 likes

Total Posts

6 posts

Correct reply

0 solutions
Top badges earned
Boost 3
Ignite 3
Give Back
Validate 1
Boost 1
View profile
neelanshb11
- Adobe Experience Manager
Thanks, it worked 🙂

Views

49

Like

1

Replies

0
AEM as a cloud service : Production Build failing
Avatar
Boost 3
Level 2
neelanshb11
Level 2

Likes

4 likes

Total Posts

6 posts

Correct reply

0 solutions
Top badges earned
Boost 3
Ignite 3
Give Back
Validate 1
Boost 1
View profile
neelanshb11
- Adobe Experience Manager
Hi Community, I am facing an issue during deployment on production instance in AEMaaCS. Following is the error log : [ERROR] Tests run: 1, Failures: 1, Errors: 0, Skipped: 0, Time elapsed: 11.93 s <<< FAILURE! - in com.ranosys.website.it.tests.PublishPageValidationIT[ERROR] validateHomepage(com.ranosys.website.it.tests.PublishPageValidationIT) Time elapsed: 8.335 s <<< FAILURE!java.lang.AssertionError: Empty response body from [https://publish-p51279-e307288.adobeaemcloud.net/etc.clientlibs/rano...

Views

77

Likes

0

Replies

2
Re: Required Java knowledge for AEM 6.5
Avatar
Boost 3
Level 2
neelanshb11
Level 2

Likes

4 likes

Total Posts

6 posts

Correct reply

0 solutions
Top badges earned
Boost 3
Ignite 3
Give Back
Validate 1
Boost 1
View profile
neelanshb11
- Adobe Experience Manager
Thanks but wanted to know in more detail because I've gone through a udemy course, got some videos from youtube too. But when I go for understanding the java files in AEM, I'm unable to do that.

Views

158

Like

1

Replies

1
Graphql error: did not yield content fragment
Avatar
Boost 3
Level 2
neelanshb11
Level 2

Likes

4 likes

Total Posts

6 posts

Correct reply

0 solutions
Top badges earned
Boost 3
Ignite 3
Give Back
Validate 1
Boost 1
View profile
neelanshb11
- Adobe Experience Manager
Hello, I am using aem cloud sanbox environment.I am using graphql to fetch content fragment. It is working perfectly on author instance but when I check on publish instance then getting this error in response: {"errors":[{"message":"Exception while fetching data (/ourClientsReferenceByPath) : Path: '%2Fcontent%2Fdam%2Franosys-website%2Four-clients%2Fparent-fragment%2Fclients-homepage' did not yield a Content Fragment","locations":[{"line":2,"column":3}],"path":["ourClientsReferenceByPath"],"exte...

Views

70

Likes

0

Replies

1
Getting error during project build
Avatar
Boost 3
Level 2
neelanshb11
Level 2

Likes

4 likes

Total Posts

6 posts

Correct reply

0 solutions
Top badges earned
Boost 3
Ignite 3
Give Back
Validate 1
Boost 1
View profile
neelanshb11
- Adobe Experience Manager
[ERROR] Failed to execute goal on project aemgeeks.core: Could not resolve dependencies for project com.aem.geeks:aemgeeks.core:jar:1.0-SNAPSHOT: Failure to find org.apache.commons:commons-imaging:jar:1.0-R1534292 in https://repo.maven.apache.org/maven2 was cached in the local repository, resolution will not be reattempted until the update interval of central has elapsed or updates are forced -> [Help 1] Please help to provide solution.

Views

360

Like

1

Replies

7