Maven build failure: Socket write error

Avatar

Avatar

tahir1601

Avatar

tahir1601

tahir1601

05-07-2019

Hi All,

I am getting below error when trying to deploy.(mvn clean install -PautoInstallBundle)

[INFO] ------------------------------------------------------------------------

[INFO] BUILD FAILURE

[INFO] ------------------------------------------------------------------------

[INFO] Total time:  17.688 s

[INFO] Finished at: 2019-07-06T11:03:18+05:30

[INFO] ------------------------------------------------------------------------

[ERROR] Failed to execute goal org.apache.sling:maven-sling-plugin:2.2.0:install (install-bundle) on project jacobdelafon.core: Installation on http://localhost:4502/system/console/apps/kohler/jacobdelafon/install/ failed, cause: Software caused connection abort: socket write error -> [Help 1]

org.apache.maven.lifecycle.LifecycleExecutionException: Failed to execute goal org.apache.sling:maven-sling-plugin:2.2.0:install (install-bundle) on project jacobdelafon.core: Installation on http://localhost:4502/system/console/apps/kohler/jacobdelafon/install/ failed, cause: Software caused connection abort: socket write error

Can Someone tell what could the issue be??

smacdonald2008Arun PatidarJoerg Hoh​@

View Entire Topic

Avatar

Avatar

tahir1601

Avatar

tahir1601

tahir1601

10-07-2019

Nope. I made above changes in pom and it worked.