{"text_format":"1","workbook":"xlsx","n_sheets":5,"sheets":["summary","dataExtract","dataTable","dataExternalFacebook","information"],"not_rendered":{"charts":6,"images":1,"macros":1,"external_links":0,"defined_names":15,"comments":0,"pivot_tables":0},"unopened":[],"bounds":{"document_bytes":16777216,"sheet_cells":100000,"rows_first":2000,"rows_last":500,"rows_between":2000,"halvings":0,"cell_chars":16384,"cell_head_chars":4096},"cells_cut":0,"cells_raw":0,"read":"whole","date_system":"1900"}

{"sheet":"summary","index":0,"n_rows":9,"n_cols":12,"rows_kept":9,"cut":false,"hidden":false,"merged":[]}
[null,null,null,null,null,null,null,null,null,null,"Operational Dashboard"]
[]
[null,null,null,null,null,null,null,null,null,"Date:",{"$f":"reportDate","v":"2019-03-27"}]
[null,null,null,null,null,null,null,null,null,null,null,"1. Step"]
[]
[]
[]
[]
[null,null,null,null,null,null,null,null,null,null,null,"2.Step 2"]

{"sheet":"dataExtract","index":1,"n_rows":366,"n_cols":27,"rows_kept":366,"cut":false,"hidden":true,"merged":[]}
["Day","Visits",null,null,"Week","Orders (p)",null,"Week","Product","Orders (p)",null,null,null,"Day","Visits","Visits Lower Bound","Visits Expected","Visits Upper Bound",null,null,"Metrics","Orders (p)","Orders (p)","Orders (p)","Orders (p)","Orders (p)","Orders (p)"]
["2018-11-01",7661,null,null,"2019-01-27",2754,null,"2019-01-27","Basic High Waist Jean",53,null,null,null,"2018-11-01",9823,6363,8158,9954,null,null,"Product Department","Womens","Mens","Beauty & Fragrance","Jewelry & Accessories","Children & Toys","::unspecified::"]
["2018-11-02",9292,null,null,"2019-02-03",2749,null,"2019-02-03","Basic High Waist Jean",46,null,null,null,"2018-11-02",8513,7894,9746,11599,null,null,43551.151388888888,6,4,0,8,4,0]
["2018-11-03",6870,null,null,"2019-02-10",2735,null,"2019-02-10","Basic High Waist Jean",41,null,null,null,"2018-11-03",4659,3265,5135,7005,null,null,43551.193055555559,14,12,2,4,0,0]
["2018-11-04",4532,null,null,"2019-02-17",2795,null,"2019-02-17","Basic High Waist Jean",53,null,null,null,"2018-11-04",5327,3044,4895,6747,null,null,43551.234722222223,18,8,4,4,4,0]
["2018-11-05",5870,null,null,"2019-02-24",2694,null,"2019-02-24","Basic High Waist Jean",43,null,null,null,"2018-11-05",8926,7085,8917,10750,null,null,43551.276388888888,30,28,6,2,6,0]
["2018-11-06",8404,null,null,"2019-03-03",2702,null,"2019-03-03","Basic High Waist Jean",52,null,null,null,"2018-11-06",8464,7624,9434,11243,null,null,43551.318055555559,28,28,16,12,14,2]
["2018-11-07",8201,null,null,"2019-03-10",2566,null,"2019-03-10","Basic High Waist Jean",46,null,null,null,"2018-11-07",8628,7037,8849,10660,null,null,43551.359722222223,24,16,12,6,20,2]
["2018-11-08",8182,null,null,"2019-03-17",2819,null,"2019-03-17","Basic High Waist Jean",38,null,null,null,"2018-11-08",8958,7115,8907,10698,null,null,43551.401388888888,40,16,20,6,20,0]
["2018-11-09",8458,null,null,null,null,null,null,null,null,null,null,null,"2018-11-09",8411,7111,8881,10651,null,null,43551.443055555559,30,38,18,12,10,0]
["2018-11-10",6929,null,null,null,null,null,null,null,null,null,null,null,"2018-11-10",4785,3278,5033,6789,null,null,43551.484722222223,42,24,20,12,4,0]
["2018-11-11",4536,null,null,null,null,null,null,null,null,null,null,null,"2018-11-11",5019,3284,5021,6759,null,null,43551.526388888888,30,18,20,12,10,0]
["2018-11-12",5845,null,null,null,null,null,null,null,null,null,null,null,"2018-11-12",9107,6890,8609,10327,null,null,43551.568055555559,36,20,24,24,18,0]
["2018-11-13",8698,null,null,null,null,null,null,null,null,null,null,null,"2018-11-13",8817,7908,9614,11320,null,null,43551.609722222223,42,6,12,16,4,0]
["2018-11-14",9056,null,null,null,null,null,null,null,null,null,null,null,"2018-11-14",11485,7318,9021,10724]
["2018-11-15",11387,null,null,null,null,null,null,null,null,null,null,null,"2018-11-15",12677,9677,11429,13181]
["2018-11-16",12179,null,null,null,null,null,null,null,null,null,null,null,"2018-11-16",11604,10592,12361,14129]
["2018-11-17",9928,null,null,null,null,null,null,null,null,null,null,null,"2018-11-17",6010,6419,8182,9946]
["2018-11-18",5627,null,null,null,null,null,null,null,null,null,null,null,"2018-11-18",6082,4935,6746,8557]
["2018-11-19",7239,null,null,null,null,null,null,null,null,null,null,null,"2018-11-19",12213,8058,9860,11663]
{"$rows_left_out":347}
{"sheet":"dataTable","index":2,"n_rows":366,"n_cols":34,"rows_kept":366,"cut":false,"hidden":true,"merged":[]}
["Date","Visits","=IF(dataExtract!B2=0,NA(),dataExtract!B2)",null,"Week","Date","Orders","4 Weeks Prior Orders",null,null,null,"Date","Orders",null,null,"Day","Organic Reach","Paid Reach","Total Reach",null,"Day","Visits",null,"Visits Expected","Visits Upper Bound","Expected Range",null,null,"Orders",{"$f":"+dataExtract!V2","v":"Womens"},{"$f":"+dataExtract!W2","v":"Mens"},{"$f":"+dataExtract!X2","v":"Beauty & Fragrance"},{"$f":"+dataExtract!Y2","v":"Jewelry & Accessories"},{"$f":"+dataExtract!Z2","v":"Children & Toys"}]
[{"$f":"dataExtract!A2","v":"2018-11-01"},{"$f":"IF(dataExtract!B2=0,NA(),IF(A2>=todayDate,NA(),dataExtract!B2))","v":7661},"=IF(dataExtract!B2=0,NA(),IF(A2>=todayDate,NA(),dataExtract!B2))",null,1,{"$f":"F3-7","v":"2019-02-24"},{"$f":"VLOOKUP(F2,dataExtract!E:F,2,FALSE)","v":2694},{"$f":"VLOOKUP(reportWeekStart-(8-E2)*7,dataExtract!$E:$F,2,FALSE)","v":2754},null,null,null,{"$f":"+dataExtract!H2","v":"2019-01-27"},{"$f":"+dataExtract!J2","v":53},null,null,{"$f":"dataExtract!A2","v":"2018-11-01"},{"$f":"VLOOKUP(P2,dataExternalFacebook!A:M,13,FALSE)","v":76756},{"$f":"S2-Q2","v":20881.600000000006},{"$f":"VLOOKUP(P2,dataExternalFacebook!A:M,10,FALSE)","v":97637.6},null,{"$f":"+dataExtract!N2","v":"2018-11-01"},{"$f":"+dataExtract!O2","v":9823},{"$f":"+dataExtract!P2","v":6363},{"$f":"+dataExtract!Q2","v":8158},{"$f":"+dataExtract!R2","v":9954},{"$f":"Y2-W2","v":3591},null,null,{"$f":"dataExtract!U3","v":43551.151388888888},{"$f":"+dataExtract!V3","v":6},{"$f":"+dataExtract!W3","v":4},{"$f":"+dataExtract!X3","v":0},{"$f":"+dataExtract!Y3","v":8},{"$f":"+dataExtract!Z3","v":4}]
[{"$f":"dataExtract!A3","v":"2018-11-02"},{"$f":"IF(dataExtract!B3=0,NA(),IF(A3>=todayDate,NA(),dataExtract!B3))","v":9292},null,null,2,{"$f":"F4-7","v":"2019-03-03"},{"$f":"VLOOKUP(F3,dataExtract!E:F,2,FALSE)","v":2702},{"$f":"VLOOKUP(reportWeekStart-(8-E3)*7,dataExtract!$E:$F,2,FALSE)","v":2749},null,null,null,{"$f":"+dataExtract!H3","v":"2019-02-03"},{"$f":"+dataExtract!J3","v":46},null,null,{"$f":"dataExtract!A3","v":"2018-11-02"},{"$f":"VLOOKUP(P3,dataExternalFacebook!A:M,13,FALSE)","v":76880},{"$f":"S3-Q3","v":20915.080000000002},{"$f":"VLOOKUP(P3,dataExternalFacebook!A:M,10,FALSE)","v":97795.08},null,{"$f":"+dataExtract!N3","v":"2018-11-02"},{"$f":"+dataExtract!O3","v":8513},{"$f":"+dataExtract!P3","v":7894},{"$f":"+dataExtract!Q3","v":9746},{"$f":"+dataExtract!R3","v":11599},{"$f":"Y3-W3","v":3705},null,null,{"$f":"dataExtract!U4","v":43551.193055555559},{"$f":"+dataExtract!V4","v":14},{"$f":"+dataExtract!W4","v":12},{"$f":"+dataExtract!X4","v":2},{"$f":"+dataExtract!Y4","v":4},{"$f":"+dataExtract!Z4","v":0}]
[{"$f":"dataExtract!A4","v":"2018-11-03"},{"$f":"IF(dataExtract!B4=0,NA(),IF(A4>=todayDate,NA(),dataExtract!B4))","v":6870},null,null,3,{"$f":"F5-7","v":"2019-03-10"},{"$f":"VLOOKUP(F4,dataExtract!E:F,2,FALSE)","v":2566},{"$f":"VLOOKUP(reportWeekStart-(8-E4)*7,dataExtract!$E:$F,2,FALSE)","v":2735},null,null,null,{"$f":"+dataExtract!H4","v":"2019-02-10"},{"$f":"+dataExtract!J4","v":41},null,null,{"$f":"dataExtract!A4","v":"2018-11-03"},{"$f":"VLOOKUP(P4,dataExternalFacebook!A:M,13,FALSE)","v":76880},20915.080000000002,{"$f":"VLOOKUP(P4,dataExternalFacebook!A:M,10,FALSE)","v":97795.08},null,{"$f":"+dataExtract!N4","v":"2018-11-03"},{"$f":"+dataExtract!O4","v":4659},{"$f":"+dataExtract!P4","v":3265},{"$f":"+dataExtract!Q4","v":5135},{"$f":"+dataExtract!R4","v":7005},3740,null,null,{"$f":"dataExtract!U5","v":43551.234722222223},{"$f":"+dataExtract!V5","v":18},{"$f":"+dataExtract!W5","v":8},{"$f":"+dataExtract!X5","v":4},{"$f":"+dataExtract!Y5","v":4},{"$f":"+dataExtract!Z5","v":4}]
[{"$f":"dataExtract!A5","v":"2018-11-04"},{"$f":"IF(dataExtract!B5=0,NA(),IF(A5>=todayDate,NA(),dataExtract!B5))","v":4532},null,null,4,{"$f":"reportWeekStart","v":"2019-03-17"},{"$f":"VLOOKUP(F5,dataExtract!E:F,2,FALSE)","v":2819},{"$f":"VLOOKUP(reportWeekStart-(8-E5)*7,dataExtract!$E:$F,2,FALSE)","v":2795},null,null,null,{"$f":"+dataExtract!H5","v":"2019-02-17"},{"$f":"+dataExtract!J5","v":53},null,null,{"$f":"dataExtract!A5","v":"2018-11-04"},{"$f":"VLOOKUP(P5,dataExternalFacebook!A:M,13,FALSE)","v":76880},21230.040000000008,{"$f":"VLOOKUP(P5,dataExternalFacebook!A:M,10,FALSE)","v":98110.040000000008},null,{"$f":"+dataExtract!N5","v":"2018-11-04"},{"$f":"+dataExtract!O5","v":5327},{"$f":"+dataExtract!P5","v":3044},{"$f":"+dataExtract!Q5","v":4895},{"$f":"+dataExtract!R5","v":6747},3703,null,null,{"$f":"dataExtract!U6","v":43551.276388888888},{"$f":"+dataExtract!V6","v":30},{"$f":"+dataExtract!W6","v":28},{"$f":"+dataExtract!X6","v":6},{"$f":"+dataExtract!Y6","v":2},{"$f":"+dataExtract!Z6","v":6}]
[{"$f":"dataExtract!A6","v":"2018-11-05"},{"$f":"IF(dataExtract!B6=0,NA(),IF(A6>=todayDate,NA(),dataExtract!B6))","v":5870},null,null,null,null,null,null,null,null,null,{"$f":"+dataExtract!H6","v":"2019-02-24"},{"$f":"+dataExtract!J6","v":43},null,null,{"$f":"dataExtract!A6","v":"2018-11-05"},{"$f":"VLOOKUP(P6,dataExternalFacebook!A:M,13,FALSE)","v":76880},21230.040000000008,{"$f":"VLOOKUP(P6,dataExternalFacebook!A:M,10,FALSE)","v":98110.040000000008},null,{"$f":"+dataExtract!N6","v":"2018-11-05"},{"$f":"+dataExtract!O6","v":8926},{"$f":"+dataExtract!P6","v":7085},{"$f":"+dataExtract!Q6","v":8917},{"$f":"+dataExtract!R6","v":10750},3665,null,null,{"$f":"dataExtract!U7","v":43551.318055555559},{"$f":"+dataExtract!V7","v":28},{"$f":"+dataExtract!W7","v":28},{"$f":"+dataExtract!X7","v":16},{"$f":"+dataExtract!Y7","v":12},{"$f":"+dataExtract!Z7","v":14}]
[{"$f":"dataExtract!A7","v":"2018-11-06"},{"$f":"IF(dataExtract!B7=0,NA(),IF(A7>=todayDate,NA(),dataExtract!B7))","v":8404},null,null,null,null,null,null,null,null,null,{"$f":"+dataExtract!H7","v":"2019-03-03"},{"$f":"+dataExtract!J7","v":52},null,null,{"$f":"dataExtract!A7","v":"2018-11-06"},{"$f":"VLOOKUP(P7,dataExternalFacebook!A:M,13,FALSE)","v":76756},21039.08,{"$f":"VLOOKUP(P7,dataExternalFacebook!A:M,10,FALSE)","v":97795.08},null,{"$f":"+dataExtract!N7","v":"2018-11-06"},{"$f":"+dataExtract!O7","v":8464},{"$f":"+dataExtract!P7","v":7624},{"$f":"+dataExtract!Q7","v":9434},{"$f":"+dataExtract!R7","v":11243},3619,null,null,{"$f":"dataExtract!U8","v":43551.359722222223},{"$f":"+dataExtract!V8","v":24},{"$f":"+dataExtract!W8","v":16},{"$f":"+dataExtract!X8","v":12},{"$f":"+dataExtract!Y8","v":6},{"$f":"+dataExtract!Z8","v":20}]
[{"$f":"dataExtract!A8","v":"2018-11-07"},{"$f":"IF(dataExtract!B8=0,NA(),IF(A8>=todayDate,NA(),dataExtract!B8))","v":8201},null,null,null,null,null,null,null,null,null,{"$f":"+dataExtract!H8","v":"2019-03-10"},{"$f":"+dataExtract!J8","v":46},null,null,{"$f":"dataExtract!A8","v":"2018-11-07"},{"$f":"VLOOKUP(P8,dataExternalFacebook!A:M,13,FALSE)","v":76756},20881.600000000006,{"$f":"VLOOKUP(P8,dataExternalFacebook!A:M,10,FALSE)","v":97637.6},null,{"$f":"+dataExtract!N8","v":"2018-11-07"},{"$f":"+dataExtract!O8","v":8628},{"$f":"+dataExtract!P8","v":7037},{"$f":"+dataExtract!Q8","v":8849},{"$f":"+dataExtract!R8","v":10660},3623,null,null,{"$f":"dataExtract!U9","v":43551.401388888888},{"$f":"+dataExtract!V9","v":40},{"$f":"+dataExtract!W9","v":16},{"$f":"+dataExtract!X9","v":20},{"$f":"+dataExtract!Y9","v":6},{"$f":"+dataExtract!Z9","v":20}]
[{"$f":"dataExtract!A9","v":"2018-11-08"},{"$f":"IF(dataExtract!B9=0,NA(),IF(A9>=todayDate,NA(),dataExtract!B9))","v":8182},null,null,null,null,null,null,null,null,null,{"$f":"+dataExtract!H9","v":"2019-03-17"},{"$f":"+dataExtract!J9","v":38},null,null,{"$f":"dataExtract!A9","v":"2018-11-08"},{"$f":"VLOOKUP(P9,dataExternalFacebook!A:M,13,FALSE)","v":76756},20881.600000000006,{"$f":"VLOOKUP(P9,dataExternalFacebook!A:M,10,FALSE)","v":97637.6},null,{"$f":"+dataExtract!N9","v":"2018-11-08"},{"$f":"+dataExtract!O9","v":8958},{"$f":"+dataExtract!P9","v":7115},{"$f":"+dataExtract!Q9","v":8907},{"$f":"+dataExtract!R9","v":10698},3583,null,null,{"$f":"dataExtract!U10","v":43551.443055555559},{"$f":"+dataExtract!V10","v":30},{"$f":"+dataExtract!W10","v":38},{"$f":"+dataExtract!X10","v":18},{"$f":"+dataExtract!Y10","v":12},{"$f":"+dataExtract!Z10","v":10}]
[{"$f":"dataExtract!A10","v":"2018-11-09"},{"$f":"IF(dataExtract!B10=0,NA(),IF(A10>=todayDate,NA(),dataExtract!B10))","v":8458},null,null,null,null,null,null,null,null,null,null,null,null,null,{"$f":"dataExtract!A10","v":"2018-11-09"},{"$f":"VLOOKUP(P10,dataExternalFacebook!A:M,13,FALSE)","v":81344},22120.36,{"$f":"VLOOKUP(P10,dataExternalFacebook!A:M,10,FALSE)","v":103464.36},null,{"$f":"+dataExtract!N10","v":"2018-11-09"},{"$f":"+dataExtract!O10","v":8411},{"$f":"+dataExtract!P10","v":7111},{"$f":"+dataExtract!Q10","v":8881},{"$f":"+dataExtract!R10","v":10651},3540,null,null,{"$f":"dataExtract!U11","v":43551.484722222223},{"$f":"+dataExtract!V11","v":42},{"$f":"+dataExtract!W11","v":24},{"$f":"+dataExtract!X11","v":20},{"$f":"+dataExtract!Y11","v":12},{"$f":"+dataExtract!Z11","v":4}]
[{"$f":"dataExtract!A11","v":"2018-11-10"},{"$f":"IF(dataExtract!B11=0,NA(),IF(A11>=todayDate,NA(),dataExtract!B11))","v":6929},null,null,null,null,null,null,null,null,null,null,null,null,null,{"$f":"dataExtract!A11","v":"2018-11-10"},{"$f":"VLOOKUP(P11,dataExternalFacebook!A:M,13,FALSE)","v":84692},23181.800000000003,{"$f":"VLOOKUP(P11,dataExternalFacebook!A:M,10,FALSE)","v":107873.8},null,{"$f":"+dataExtract!N11","v":"2018-11-10"},{"$f":"+dataExtract!O11","v":4785},{"$f":"+dataExtract!P11","v":3278},{"$f":"+dataExtract!Q11","v":5033},{"$f":"+dataExtract!R11","v":6789},3511,null,null,{"$f":"dataExtract!U12","v":43551.526388888888},{"$f":"+dataExtract!V12","v":30},{"$f":"+dataExtract!W12","v":18},{"$f":"+dataExtract!X12","v":20},{"$f":"+dataExtract!Y12","v":12},{"$f":"+dataExtract!Z12","v":10}]
[{"$f":"dataExtract!A12","v":"2018-11-11"},{"$f":"IF(dataExtract!B12=0,NA(),IF(A12>=todayDate,NA(),dataExtract!B12))","v":4536},null,null,null,null,null,null,null,null,null,null,null,null,null,{"$f":"dataExtract!A12","v":"2018-11-11"},{"$f":"VLOOKUP(P12,dataExternalFacebook!A:M,13,FALSE)","v":85436},23225.199999999997,{"$f":"VLOOKUP(P12,dataExternalFacebook!A:M,10,FALSE)","v":108661.2},null,{"$f":"+dataExtract!N12","v":"2018-11-11"},{"$f":"+dataExtract!O12","v":5019},{"$f":"+dataExtract!P12","v":3284},{"$f":"+dataExtract!Q12","v":5021},{"$f":"+dataExtract!R12","v":6759},3475,null,null,{"$f":"dataExtract!U13","v":43551.568055555559},{"$f":"+dataExtract!V13","v":36},{"$f":"+dataExtract!W13","v":20},{"$f":"+dataExtract!X13","v":24},{"$f":"+dataExtract!Y13","v":24},{"$f":"+dataExtract!Z13","v":18}]
[{"$f":"dataExtract!A13","v":"2018-11-12"},{"$f":"IF(dataExtract!B13=0,NA(),IF(A13>=todayDate,NA(),dataExtract!B13))","v":5845},null,null,null,null,null,null,null,null,null,null,null,null,null,{"$f":"dataExtract!A13","v":"2018-11-12"},{"$f":"VLOOKUP(P13,dataExternalFacebook!A:M,13,FALSE)","v":85560},23416.160000000003,{"$f":"VLOOKUP(P13,dataExternalFacebook!A:M,10,FALSE)","v":108976.16},null,{"$f":"+dataExtract!N13","v":"2018-11-12"},{"$f":"+dataExtract!O13","v":9107},{"$f":"+dataExtract!P13","v":6890},{"$f":"+dataExtract!Q13","v":8609},{"$f":"+dataExtract!R13","v":10327},3437,null,null,{"$f":"dataExtract!U14","v":43551.609722222223},{"$f":"+dataExtract!V14","v":42},{"$f":"+dataExtract!W14","v":6},{"$f":"+dataExtract!X14","v":12},{"$f":"+dataExtract!Y14","v":16},{"$f":"+dataExtract!Z14","v":4}]
[{"$f":"dataExtract!A14","v":"2018-11-13"},{"$f":"IF(dataExtract!B14=0,NA(),IF(A14>=todayDate,NA(),dataExtract!B14))","v":8698},null,null,null,null,null,null,null,null,null,null,null,null,null,{"$f":"dataExtract!A14","v":"2018-11-13"},{"$f":"VLOOKUP(P14,dataExternalFacebook!A:M,13,FALSE)","v":79236},21551.199999999997,{"$f":"VLOOKUP(P14,dataExternalFacebook!A:M,10,FALSE)","v":100787.2},null,{"$f":"+dataExtract!N14","v":"2018-11-13"},{"$f":"+dataExtract!O14","v":8817},{"$f":"+dataExtract!P14","v":7908},{"$f":"+dataExtract!Q14","v":9614},{"$f":"+dataExtract!R14","v":11320},3412]
[{"$f":"dataExtract!A15","v":"2018-11-14"},{"$f":"IF(dataExtract!B15=0,NA(),IF(A15>=todayDate,NA(),dataExtract!B15))","v":9056},null,null,null,null,null,null,null,null,null,null,null,null,null,{"$f":"dataExtract!A15","v":"2018-11-14"},{"$f":"VLOOKUP(P15,dataExternalFacebook!A:M,13,FALSE)","v":78368},21474.320000000007,{"$f":"VLOOKUP(P15,dataExternalFacebook!A:M,10,FALSE)","v":99842.32},null,{"$f":"+dataExtract!N15","v":"2018-11-14"},{"$f":"+dataExtract!O15","v":11485},{"$f":"+dataExtract!P15","v":7318},{"$f":"+dataExtract!Q15","v":9021},{"$f":"+dataExtract!R15","v":10724},3406]
[{"$f":"dataExtract!A16","v":"2018-11-15"},{"$f":"IF(dataExtract!B16=0,NA(),IF(A16>=todayDate,NA(),dataExtract!B16))","v":11387},null,null,null,null,null,null,null,null,null,null,null,null,null,{"$f":"dataExtract!A16","v":"2018-11-15"},{"$f":"VLOOKUP(P16,dataExternalFacebook!A:M,13,FALSE)","v":77376},21049,{"$f":"VLOOKUP(P16,dataExternalFacebook!A:M,10,FALSE)","v":98425},null,{"$f":"+dataExtract!N16","v":"2018-11-15"},{"$f":"+dataExtract!O16","v":12677},{"$f":"+dataExtract!P16","v":9677},{"$f":"+dataExtract!Q16","v":11429},{"$f":"+dataExtract!R16","v":13181},3504]
[{"$f":"dataExtract!A17","v":"2018-11-16"},{"$f":"IF(dataExtract!B17=0,NA(),IF(A17>=todayDate,NA(),dataExtract!B17))","v":12179},null,null,null,null,null,null,null,null,null,null,null,null,null,{"$f":"dataExtract!A17","v":"2018-11-16"},{"$f":"VLOOKUP(P17,dataExternalFacebook!A:M,13,FALSE)","v":78244},21125.880000000005,{"$f":"VLOOKUP(P17,dataExternalFacebook!A:M,10,FALSE)","v":99369.88},null,{"$f":"+dataExtract!N17","v":"2018-11-16"},{"$f":"+dataExtract!O17","v":11604},{"$f":"+dataExtract!P17","v":10592},{"$f":"+dataExtract!Q17","v":12361},{"$f":"+dataExtract!R17","v":14129},3537]
[{"$f":"dataExtract!A18","v":"2018-11-17"},{"$f":"IF(dataExtract!B18=0,NA(),IF(A18>=todayDate,NA(),dataExtract!B18))","v":9928},null,null,null,null,null,null,null,null,null,null,null,null,null,{"$f":"dataExtract!A18","v":"2018-11-17"},{"$f":"VLOOKUP(P18,dataExternalFacebook!A:M,13,FALSE)","v":81964},22130.28,{"$f":"VLOOKUP(P18,dataExternalFacebook!A:M,10,FALSE)","v":104094.28},null,{"$f":"+dataExtract!N18","v":"2018-11-17"},{"$f":"+dataExtract!O18","v":6010},{"$f":"+dataExtract!P18","v":6419},{"$f":"+dataExtract!Q18","v":8182},{"$f":"+dataExtract!R18","v":9946},3527]
[{"$f":"dataExtract!A19","v":"2018-11-18"},{"$f":"IF(dataExtract!B19=0,NA(),IF(A19>=todayDate,NA(),dataExtract!B19))","v":5627},null,null,null,null,null,null,null,null,null,null,null,null,null,{"$f":"dataExtract!A19","v":"2018-11-18"},{"$f":"VLOOKUP(P19,dataExternalFacebook!A:M,13,FALSE)","v":84568},22833.360000000001,{"$f":"VLOOKUP(P19,dataExternalFacebook!A:M,10,FALSE)","v":107401.36},null,{"$f":"+dataExtract!N19","v":"2018-11-18"},{"$f":"+dataExtract!O19","v":6082},{"$f":"+dataExtract!P19","v":4935},{"$f":"+dataExtract!Q19","v":6746},{"$f":"+dataExtract!R19","v":8557},3622]
[{"$f":"dataExtract!A20","v":"2018-11-19"},{"$f":"IF(dataExtract!B20=0,NA(),IF(A20>=todayDate,NA(),dataExtract!B20))","v":7239},null,null,null,null,null,null,null,null,null,null,null,null,null,{"$f":"dataExtract!A20","v":"2018-11-19"},{"$f":"VLOOKUP(P20,dataExternalFacebook!A:M,13,FALSE)","v":85064},22967.279999999999,{"$f":"VLOOKUP(P20,dataExternalFacebook!A:M,10,FALSE)","v":108031.28},null,{"$f":"+dataExtract!N20","v":"2018-11-19"},{"$f":"+dataExtract!O20","v":12213},{"$f":"+dataExtract!P20","v":8058},{"$f":"+dataExtract!Q20","v":9860},{"$f":"+dataExtract!R20","v":11663},3605]
{"$rows_left_out":347}
{"sheet":"dataExternalFacebook","index":3,"n_rows":366,"n_cols":13,"rows_kept":366,"cut":false,"hidden":true,"merged":[]}
["Date","Lifetime Total Likes","Daily New Likes","Daily Unlikes","Daily Page Engaged Users","Weekly Page Engaged Users","28 Days Page Engaged Users","Daily Total Reach","Weekly Total Reach","28 Days Total Reach","Daily Organic Reach","Weekly Organic Reach","28 Days Organic Reach"]
["2018-11-01",35535,"","",248,10664,13516,1488,65224,97637.6,1488,65224,76756]
["2018-11-02",35650,1,"",248,10664,13516,1240,65720,97795.08,1240,65720,76880]
["2018-11-03",35650,"","",124,10664,13516,372,65596,97795.08,372,65596,76880]
["2018-11-04",35650,"","",56,10664,13392,248,65596,98110.040000000008,248,65596,76880]
["2018-11-05",35650,"","",56,3472,13392,124,34596,98110.040000000008,124,34596,76880]
["2018-11-06",35650,"","",56,1736,13392,124,11780,97795.08,124,11780,76756]
["2018-11-07",35650,"","",56,620,13268,124,3720,97637.6,124,3720,76756]
["2018-11-08",35650,"","",56,372,13268,124,2356,97637.6,124,2356,76756]
["2018-11-09",35765,1,"",6572,6696,16244,30380,31372,103464.36,30380,31372,81344]
["2018-11-10",35765,"","",4092,9424,18228,22692,43152,107873.8,22692,43152,84692]
["2018-11-11",35765,"","",496,9920,18476,4216,44888,108661.2,4092,44888,85436]
["2018-11-12",35765,"","",620,10416,18600,2232,45632,108976.16,2232,45632,85560]
["2018-11-13",35765,"","",null,10416,17980,1612,46128,100787.2,1612,46128,79236]
["2018-11-14",35765,"","",null,10416,17980,372,46004,99842.32,248,46004,78368]
["2018-11-15",35765,"","",null,10416,17236,372,46004,98425,372,46004,77376]
["2018-11-16",35880,1,"",2976,7812,18476,17856,34596,99369.88,17856,34596,78244]
["2018-11-17",35995,1,"",6324,9424,21948,36208,41292,104094.28,36208,41292,81964]
["2018-11-18",35995,1,1,4712,11532,22816,26660,49724,107401.36,26660,49724,84568]
["2018-11-19",35995,"","",744,11656,23064,4588,51460,108031.28,4588,51460,85064]
{"$rows_left_out":347}
{"sheet":"information","index":4,"n_rows":24,"n_cols":3,"rows_kept":24,"cut":false,"hidden":true,"merged":[]}
["Adobe Lab Exercise"]
[]
["Author","Kristi Barrow"]
[]
["Date",{"$f":"TODAY()","v":"2019-03-27"}]
[]
["Report Date",{"$f":"TODAY()","v":"2019-03-27"}]
[]
["Report Week Start Date",{"$f":"+reportWeekEnd-6","v":"2019-03-17"}]
[]
["Report Week End Date",{"$f":"INT((B7-1)/7)*7+0","v":"2019-03-23"}]
[]
["Product",{"$f":"VLOOKUP(B24,B17:C20,2,FALSE)","v":"Basic High Waist Jean"}]
[]
["Chart Title",{"$f":"B13&\" - Orders for last 8 weeks\"","v":"Basic High Waist Jean - Orders for last 8 weeks"}]
[]
["Products",1,"Basic High Waist Jean"]
[null,2,"Bling Belt High Waist Jean"]
[null,3,"Dark Slimmer Jean"]
[null,4,"Baby Blue Low Waist Jean"]
{"$rows_left_out":4}